{"text_format":"1","workbook":"xlsx","n_sheets":3,"sheets":["提出用","入力例・注意事項","事務局集計用 "],"not_rendered":{"charts":0,"images":2,"macros":0,"external_links":0,"defined_names":5,"comments":0,"pivot_tables":0},"unopened":[],"bounds":{"document_bytes":16777216,"sheet_cells":100000,"rows_first":2000,"rows_last":500,"rows_between":2000,"halvings":0,"cell_chars":16384,"cell_head_chars":4096},"cells_cut":0,"cells_raw":0,"read":"whole","date_system":"1900"}

{"sheet":"提出用","index":0,"n_rows":104,"n_cols":37,"rows_kept":104,"cut":false,"hidden":false,"merged":[[52,0,52,20],[53,1,53,20],[54,0,54,20],[55,0,55,20],[9,3,9,20],[10,3,10,20],[30,8,31,20],[50,0,50,20],[50,22,50,42],[51,1,51,9],[51,11,51,20],[48,1,48,2],[48,4,48,12],[48,14,48,16],[48,18,48,20],[48,22,48,42],[49,0,49,20],[46,1,46,2],[46,4,46,12],[46,14,46,16],[46,18,46,20],[47,1,47,2],[47,4,47,12],[47,14,47,16],[47,18,47,20],[45,1,45,2],[45,4,45,12],[45,14,45,16],[45,18,45,20],[45,22,45,23],[45,24,45,25],[44,1,44,2],[44,4,44,12],[44,14,44,16],[44,18,44,20],[44,22,44,23],[44,24,44,25],[42,32,42,33],[42,34,42,35],[42,36,43,42],[43,28,43,29],[43,30,43,31],[43,32,43,33],[42,1,42,2],[42,4,42,12],[42,14,42,16],[42,18,42,20],[42,22,42,23],[42,24,42,25],[43,1,43,2],[43,4,43,12],[43,14,43,16],[43,18,43,20],[43,24,43,25],[43,26,43,27],[42,26,42,27],[42,28,42,29],[42,30,42,31],[40,22,40,42],[41,1,41,2],[41,4,41,12],[41,14,41,16],[41,18,41,20],[41,22,41,42],[39,1,39,2],[39,4,39,12],[39,14,39,16],[39,18,39,20],[40,1,40,2],[40,4,40,12],[40,14,40,16],[40,18,40,20],[36,22,36,42],[37,1,37,2],[37,4,37,12],[37,14,37,16],[37,18,37,20],[38,1,38,2],[38,4,38,12],[38,14,38,16],[38,18,38,20],[38,22,38,42],[34,0,34,20],[35,0,35,20],[36,1,36,2],[36,4,36,12],[36,13,36,17],[36,18,36,20],[31,0,31,4],[31,5,31,7],[32,0,32,20],[33,0,33,20],[23,13,23,20],[25,0,25,20],[27,2,27,3],[27,18,27,19],[29,0,29,20],[30,0,30,4],[30,5,30,7],[19,0,23,2],[19,4,19,11],[19,13,19,20],[20,4,20,11],[20,13,20,20],[21,4,21,11],[21,13,21,20],[22,4,22,11],[22,13,22,20],[23,4,23,11],[28,0,28,20],[17,0,17,2],[17,3,17,15],[17,16,17,20],[18,0,18,2],[18,3,18,7],[18,8,18,10],[18,11,18,15],[18,16,18,20],[15,3,15,10],[15,11,15,15],[15,16,15,20],[16,0,16,2],[16,4,16,6],[16,7,16,20],[13,0,13,2],[13,3,13,20],[13,22,13,24],[13,25,13,42],[14,0,14,2],[14,3,14,10],[14,11,14,15],[14,16,14,20],[14,22,15,42],[15,0,15,2],[12,0,12,2],[12,3,12,20],[12,22,12,24],[12,25,12,42],[9,0,9,2],[9,22,9,24],[9,25,9,42],[10,0,10,2],[10,22,10,24],[10,25,10,42],[8,0,8,20],[4,0,4,20],[11,0,11,20],[1,0,1,3],[3,0,3,20],[4,22,7,42],[5,0,5,20],[6,0,6,20],[7,0,7,2],[7,3,7,4],[7,5,7,8],[7,9,7,10],[7,11,7,14],[7,15,7,16],[7,17,7,20],[11,22,11,42]]}
[]
["提出用"]
[]
["建設技術公開「ＥＥ東北'21」新規出展申込書"]
["1．出展者・申込者の確認",null,null,null,null,null,null,null,null,null,null,null,null,null,null,null,null,null,null,null,null,null,"出展形式がグループ出展・共同出展の場合は、\n出展するすべての企業(団体)名を『　/　(半角スラッシュ)』で区切って記入(入力)してください。\nさらに、グループ出展の場合は頭にグループ名を入れてください。\n※こちらに記入(入力)した企業・団体名が出展者名プレートやガイドブックに表記する名称となります。"]
[]
["◆出展形式を選択してください　(該当欄を○で囲むかボタンをクリック)"]
["出展形式",null,null,null,null,"➊単独出展\n1企業(団体)での出展",null,null,null,null,null,"➋グループ出展\nグループ企業での出展",null,null,null,null,null,"➌共同出展\n複数企業(団体)での出展"]
["①出展者名を正式な企業・団体名で記入(入力)してください"]
["ﾌﾘｶﾞﾅ(半角)",null,null,null,null,null,null,null,null,null,null,null,null,null,null,null,null,null,null,null,null,null,"ﾌﾘｶﾞﾅ(半角)",null,null,"ｼｰｴｽﾃｨｰﾕｰﾎｰﾙﾃﾞｨﾝｸﾞｽ　ﾄｳﾎｸﾃｸﾉﾛｼﾞｰ/ｺﾝｽﾄﾗｸｼｮﾝ/ﾄｳﾎｸﾃｸﾉﾕｰｽ/ﾎﾞｳｻｲﾁｮｳｻ"]
["出展者名",null,null,null,null,null,null,null,null,null,null,null,null,null,null,null,null,null,null,null,null,null,"出展者名",null,null,"CSTUホールディングス　(株)東北テクノロジー/(株)コンストラクション/東北テクノユース(株)/防災調査(株)"]
["➁申込者名を正式な企業・団体名で記入(入力)してください",null,null,null,null,null,null,null,null,null,null,null,null,null,null,null,null,null,null,null,null,null,"こちらに記入(入力)した企業・団体名の(担当者所在地)宛てに請求書を送付します。"]
["ﾌﾘｶﾞﾅ(半角)",null,null,null,null,null,null,null,null,null,null,null,null,null,null,null,null,null,null,null,null,null,"ﾌﾘｶﾞﾅ(半角)",null,null,"ﾄｳﾎｸﾃｸﾉﾛｼﾞｰ"]
["申込者名\n(企業・団体名)",null,null,null,null,null,null,null,null,null,null,null,null,null,null,null,null,null,null,null,null,null,"申込者名\n(企業・団体名)",null,null,"(株)東北テクノロジー"]
["ﾌﾘｶﾞﾅ(半角)",null,null,null,null,null,null,null,null,null,null,"所属部署",null,null,null,null,"役　職",null,null,null,null,null,"出展形式がグループ出展・共同出展の場合は、\n代表となる企業・団体名と申込に関する窓口となる担当者を記入(入力)してください。"]
["担当者氏名"]
["所在地",null,null,"〒"]
["E-mail",null,null,null,null,null,null,null,null,null,null,null,null,null,null,null,"出展申込者の本社・本部等の\n所在地（都道府県）"]
["ＴＥＬ",null,null,null,null,null,null,null,"ＦＡＸ"]
["所属する\n構成団体\n\n(該当欄を\n○で囲むか\nボタンをクリック)",null,null,null,"(一社)日本建設業連合会 東北支部",null,null,null,null,null,null,null,null,"(一社)日本道路建設業協会 東北支部"]
[null,null,null,null,"東北建設業協会連合会",null,null,null,null,null,null,null,null,"(一社)日本建設機械施工協会 東北支部"]
[null,null,null,null,"(一社)東北コンクリート製品協会",null,null,null,null,null,null,null,null,"(一社)全国特定法面保護協会 東北地方支部"]
[null,null,null,null,"(一社)日本埋立浚渫協会 東北地方支部",null,null,null,null,null,null,null,null,"(一社)建設電気技術協会 東北地方支部"]
[null,null,null,null,"(一社)建設コンサルタンツ協会",null,null,null,null,null,null,null,null,"★記載の団体に属さない場合はこちら"]
[]
["◆出展者の過去のＥＥ東北への出展回数をわかる範囲でお知らせください  　(該当欄を○で囲むか、ボタンをクリック)"]
[]
[null,null,"なし\n※初めての申込",null,null,null,"１～9回",null,null,null,"10～19回",null,null,null,"20～28回",null,null,null,"29回\n※すべて出展"]
["EE東北2020へのお申し込みは、出展回数に含めないでください。"]
["2．出展小間の希望"]
["屋内小間",null,null,null,null,"必要小間数",null,null,"屋外小間の受付はございません"]
["１小間あたり\n間口3m×奥行3m×高さ2.4m"]
["※必要小間数をお申込みいただきますが(単独出店者は１小間、グループ及び共同出展者については参加企業数)、会場の都合により小間数を調整させていただく場合がございますのであらかじめご了承ください。\n"]
["3．出展技術の申請"]
["◆出展技術数(ガイドブックに掲載できる技術数)は、１小間あたり最大で３技術までです。\n   ブースの配置は、代表技術として選択された技術分野のエリアへ配置されます。\n◆２技術以上出展する場合、メインとなる技術を代表として１技術選択し、一番上の枠に入力(記入)してください。\n　　(※1小間につき１技術ではなく、１出展者につき１技術）"]
["➊出展技術分野を４分野から選択し、入力(記入)してください。プルダウンリスト▼から選択できます。\n➋希望エリアは屋内を選択、入力(記入)してください。プルダウンリスト▼から選択できます。\n➌出展新技術の名称を25文字以内で入力(記入)してください。(ガイドブック掲載の都合上、文字数を制限しております。)\n➍NETIS登録番号を入力(記入)してください。前後の識別記号はプルダウンリスト▼から選択できます。\n➎i-Constructionに該当する技術の場合は、i-Constructionと入力(記入)してください。プルダウンリスト▼から選択できます。"]
["№","\n技術分野",null,"希望\nエリア","\n出展新技術の名称（25文字以内）\n※25文字を超えている場合は、ガイドブック原稿提出までに\n修正いただきます。",null,null,null,null,null,null,null,null,"\nNETIS登録番号\n※掲載期間が終了している番号は入力しないで下さい。",null,null,null,null,"i-Construction\nに該当",null,null,null,"i-Constructionに該当技術を出展の場合は、会場ブースの社名プレートとガイドブック・ガイドマップに\n　　　　　　　　こちらのロゴマークが表示されます。"]
[1]
[2,null,null,null,null,null,null,null,null,null,null,null,null,null,null,null,null,null,null,null,null,null,"現時点で、出展技術名が決定していない場合は、出展予定の技術数と出展分野のみを確定させ、(仮)として入力してください。"]
[3,null,null,null,null,null,null,null,null,null,null,null,null,null,null,null,null,null,null,null,null,null,"確定し次第、再度ご提出いただきます。空白のまま提出しないでください。"]
{"$rows_left_out":65}
{"sheet":"入力例・注意事項","index":1,"n_rows":104,"n_cols":37,"rows_kept":104,"cut":false,"hidden":false,"merged":[[17,3,17,15],[17,16,17,20],[29,0,29,20],[30,0,30,4],[30,5,30,7],[30,8,31,20],[31,0,31,4],[31,5,31,7],[22,13,22,20],[23,4,23,11],[27,2,27,3],[27,18,27,19],[23,13,23,20],[25,0,25,20],[19,0,23,2],[19,4,19,11],[19,13,19,20],[20,4,20,11],[20,13,20,20],[21,4,21,11],[21,13,21,20],[22,4,22,11],[53,1,53,20],[54,0,54,20],[55,0,55,20],[49,0,49,20],[50,0,50,20],[52,0,52,20],[51,11,51,20],[51,1,51,9],[53,22,53,42],[49,22,49,42],[34,0,34,20],[35,0,35,20],[36,1,36,2],[36,4,36,12],[41,1,41,2],[41,4,41,12],[41,14,41,16],[41,18,41,20],[42,1,42,2],[42,4,42,12],[42,14,42,16],[42,18,42,20],[39,1,39,2],[36,13,36,17],[36,18,36,20],[32,0,32,20],[47,4,47,12],[47,14,47,16],[47,18,47,20],[39,4,39,12],[39,14,39,16],[39,18,39,20],[40,1,40,2],[44,24,44,25],[40,4,40,12],[40,14,40,16],[40,18,40,20],[37,1,37,2],[37,4,37,12],[37,14,37,16],[37,18,37,20],[38,1,38,2],[38,4,38,12],[38,14,38,16],[38,18,38,20],[33,0,33,20],[43,1,43,2],[43,4,43,12],[43,14,43,16],[48,1,48,2],[48,4,48,12],[45,1,45,2],[45,4,45,12],[45,14,45,16],[45,18,45,20],[41,22,41,23],[41,24,41,25],[48,14,48,16],[48,18,48,20],[46,1,46,2],[46,4,46,12],[46,14,46,16],[46,18,46,20],[47,1,47,2],[43,24,43,25],[44,22,44,23],[44,14,44,16],[44,18,44,20],[43,18,43,20],[44,1,44,2],[44,4,44,12],[9,25,9,42],[5,0,5,20],[10,22,10,24],[10,25,10,42],[7,15,7,16],[7,17,7,20],[8,0,8,20],[9,0,9,2],[10,0,10,2],[1,0,1,3],[3,0,3,20],[4,0,4,20],[7,0,7,2],[7,3,7,4],[7,5,7,8],[7,9,7,10],[7,11,7,14],[6,0,6,20],[11,22,11,42],[12,25,12,42],[13,22,13,24],[13,25,13,42],[4,22,7,42],[39,22,39,42],[37,22,37,42],[40,22,40,42],[47,22,47,42],[43,22,43,23],[41,36,42,42],[42,26,42,27],[42,28,42,29],[42,30,42,31],[42,32,42,33],[42,24,42,25],[41,30,41,31],[41,26,41,27],[41,28,41,29],[41,32,41,33],[41,34,41,35],[12,22,12,24],[14,22,15,42],[9,22,9,24],[9,3,9,20],[10,3,10,20],[18,0,18,2],[18,3,18,7],[18,8,18,10],[18,11,18,15],[18,16,18,20],[15,0,15,2],[15,3,15,10],[15,11,15,15],[15,16,15,20],[16,0,16,2],[16,4,16,6],[16,7,16,20],[14,0,14,2],[14,3,14,10],[14,11,14,15],[14,16,14,20],[13,0,13,2],[13,3,13,20],[11,0,11,20],[12,0,12,2],[12,3,12,20],[17,0,17,2]]}
[]
["入力例 "]
[]
["建設技術公開「ＥＥ東北'21」新規出展申込書"]
["1．出展者・申込者の確認",null,null,null,null,null,null,null,null,null,null,null,null,null,null,null,null,null,null,null,null,null,"出展形式がグループ出展・共同出展の場合は、\n出展するすべての企業(団体)名を『　/　(半角スラッシュ)』で区切って記入(入力)してください。\nさらに、グループ出展の場合は頭にグループ名を入れてください。\n※こちらに記入(入力)した企業・団体名が出展者名プレートやガイドブックに表記する名称となります。"]
[]
["◆出展形式を選択してください　(該当欄を○で囲むかボタンをクリック)"]
["出展形式",null,null,null,null,"➊単独出展\n1企業(団体)での出展",null,null,null,null,null,"➋グループ出展\nグループ企業での出展",null,null,null,null,null,"➌共同出展\n複数企業(団体)での出展"]
["①出展者名を正式な企業・団体名で記入(入力)してください"]
["ﾌﾘｶﾞﾅ(半角)",null,null,"ｾｺｳﾁｮｳｻｷﾞｼﾞｭﾂｶﾂﾖｳｾﾝﾀｰ",null,null,null,null,null,null,null,null,null,null,null,null,null,null,null,null,null,null,"ﾌﾘｶﾞﾅ(半角)",null,null,"ｼｰｴｽﾃｨｰﾕｰﾎｰﾙﾃﾞｨﾝｸﾞｽ　ﾄｳﾎｸﾃｸﾉﾛｼﾞｰ/ｺﾝｽﾄﾗｸｼｮﾝ/ﾄｳﾎｸﾃｸﾉﾕｰｽ/ﾎﾞｳｻｲﾁｮｳｻ"]
["出展者名",null,null,"㈱施工調査技術活用センター",null,null,null,null,null,null,null,null,null,null,null,null,null,null,null,null,null,null,"出展者名",null,null,"CSTUホールディングス　(株)東北テクノロジー/(株)コンストラクション/東北テクノユース(株)/防災調査(株)"]
["➁申込者名を正式な企業・団体名で記入(入力)してください",null,null,null,null,null,null,null,null,null,null,null,null,null,null,null,null,null,null,null,null,null,"こちらに記入(入力)した企業・団体名の(担当者所在地)宛てに請求書を送付します。"]
["ﾌﾘｶﾞﾅ(半角)",null,null,"ｾｺｳﾁｮｳｻｷﾞｼﾞｭﾂｶﾂﾖｳｾﾝﾀｰ",null,null,null,null,null,null,null,null,null,null,null,null,null,null,null,null,null,null,"ﾌﾘｶﾞﾅ(半角)",null,null,"ﾄｳﾎｸﾃｸﾉﾛｼﾞｰ"]
["申込者名\n(企業・団体名)",null,null,"㈱施工調査技術活用センター",null,null,null,null,null,null,null,null,null,null,null,null,null,null,null,null,null,null,"申込者名\n(企業・団体名)",null,null,"(株)東北テクノロジー"]
["ﾌﾘｶﾞﾅ(半角)",null,null,"ﾄｳｷﾞ　ﾀｶｼ",null,null,null,null,null,null,null,"所属部署",null,null,null,null,"役　職",null,null,null,null,null,"出展形式がグループ出展・共同出展の場合は、\n代表となる企業・団体名と申込に関する窓口となる担当者を記入(入力)してください。"]
["担当者氏名",null,null,"東技　崇",null,null,null,null,null,null,null,null,null,null,null,null,"センター長"]
["所在地",null,null,"〒","985-0842",null,null,"宮城県多賀城市桜木三丁目６番１号"]
["E-mail",null,null,"thr-tougi01@mlit.go.jp",null,null,null,null,null,null,null,null,null,null,null,null,"出展申込者の本社・本部等の\n所在地（都道府県）"]
["ＴＥＬ",null,null,"022-365-7983",null,null,null,null,"ＦＡＸ",null,null,"022-365-8152",null,null,null,null,"宮城県"]
["所属する\n構成団体\n\n(該当欄を\n○で囲むか\nボタンをクリック)",null,null,null,"(一社)日本建設業連合会 東北支部",null,null,null,null,null,null,null,null,"(一社)日本道路建設業協会 東北支部"]
[null,null,null,null,"東北建設業協会連合会",null,null,null,null,null,null,null,null,"(一社)日本建設機械施工協会 東北支部"]
[null,null,null,null,"(一社)東北コンクリート製品協会",null,null,null,null,null,null,null,null,"(一社)全国特定法面保護協会 東北地方支部"]
[null,null,null,null,"(一社)日本埋立浚渫協会 東北地方支部",null,null,null,null,null,null,null,null,"(一社)建設電気技術協会 東北地方支部"]
[null,null,null,null,"(一社)建設コンサルタンツ協会",null,null,null,null,null,null,null,null,"★記載の団体に属さない場合はこちら"]
[]
["◆出展者の過去のＥＥ東北への出展回数をわかる範囲でお知らせください  　(該当欄を○で囲むか、ボタンをクリック)"]
[]
[null,null,"なし\n※初めての申込",null,null,null,"１～9回",null,null,null,"10～19回",null,null,null,"20～28回",null,null,null,"29回\n※すべて出展"]
[]
["2．出展小間の希望"]
["屋内小間",null,null,null,null,"必要小間数",null,null,"屋外小間の受付はございません"]
["１小間あたり\n間口3m×奥行3m×高さ2.4m",null,null,null,null,1]
["※必要小間数をお申込みいただきますが(単独出店者は１小間、グループ及び共同出展者については参加企業数)、会場の都合により小間数を調整させていただく場合がございますのであらかじめご了承ください。\n"]
["3．出展技術の申請"]
["◆出展技術数(ガイドブックに掲載できる技術数)は、１小間あたり最大で３技術までです。\n   ブースの配置は、代表技術として選択された技術分野のエリアへ配置されます。\n◆２技術以上出展する場合、メインとなる技術を代表として１技術選択し、一番上の枠に入力(記入)してください。\n　　(※1小間につき１技術ではなく、１出展者につき１技術）"]
["➊出展技術分野を４分野から選択し、入力(記入)してください。プルダウンリスト▼から選択できます。\n➋希望エリアは屋内を選択、入力(記入)してください。プルダウンリスト▼から選択できます。\n➌出展新技術の名称を25文字以内で入力(記入)してください。(ガイドブック掲載の都合上、文字数を制限しております。)\n➍NETIS登録番号を入力(記入)してください。前後の識別記号はプルダウンリスト▼から選択できます。\n➎i-Constructionに該当する技術の場合は、i-Constructionと入力(記入)してください。プルダウンリスト▼から選択できます。"]
["№","\n技術分野",null,"希望\nエリア","\n出展新技術の名称（25文字以内）\n※25文字を超えている場合は、ガイドブック原稿提出までに\n修正いただきます。",null,null,null,null,null,null,null,null,"\nNETIS登録番号\n※掲載期間が終了している番号は入力しないで下さい。",null,null,null,null,"i-Construction\nに該当"]
[1,"Ｃ防災・安全",null,"屋内","MMS移動計測車両システム",null,null,null,null,null,null,null,null,"TH-","150101",null,null,"-A","i-Construction",null,null,null,"現時点で、出展技術名が決定していない場合は、出展予定の技術数と出展分野のみを確定させ、(仮)として入力してください。"]
[2,"Ｂ維持管理・予防保全",null,"屋内","コンクリート構造物の調査手法",null,null,null,null,null,null,null,null,null,null,null,null,null,null,null,null,null,"確定し次第、再度ご提出いただきます。空白のまま提出しないでください。"]
[3,"Ｃ防災・安全",null,"屋外","組立応急橋",null,null,null,null,null,null,null,null,null,null,null,null,null,null,null,null,null,"出展技術名はガイドブックの原稿提出の締切（令和３年1月末）までは変更が可能です。\nしかし、技術分野の変更はできません。"]
{"$rows_left_out":65}
{"sheet":"事務局集計用 ","index":2,"n_rows":38,"n_cols":40,"rows_kept":38,"cut":false,"hidden":true,"merged":[[1,7,1,12],[2,7,2,8],[2,9,2,10],[2,11,2,12],[2,13,2,22],[2,26,2,27],[2,29,2,31],[2,33,2,36],[17,4,20,10],[23,6,26,15],[2,24,2,25]]}
[]
[null,null,null,null,null,null,null,"事務局集計用 こちらのシートの様式は変更しないでください。",null,null,null,null,null,null,null,null,null,null,null,null,null,null,null,null,null,200000,null,150000,"屋外の角の希望削除"]
[null,null,null,null,null,null,null,"　出　展　者　名",null,"申　込　者　名",null,"参考情報",null,"窓　　　口",null,null,null,null,null,null,null,null,null,"屋内","屋内",null,"屋外",null,"出展料","プレゼンテーション",null,null,null,"出展技術",null,null,null,"事務局あて","Webシステム","インフラ・デモ"]
["出展意思","出展番号","小間番号","（屋外）","申込年月日",null,"★企業・団体\n☆大学・行政","ﾌﾘｶﾞﾅ\n（半角入力）","会社名\n（全角入力）","ﾌﾘｶﾞﾅ\n（半角入力）","ブース社名\n（全角入力）","過去ＥＥ\n出展回数","本社等\n所在地","氏名","E-mail","部署","役職","〒","県別","住所\n（都道府県から入力）","TEL\n（半角入力）","FAX\n（半角入力）","所属団体","角の\n希望","小間数","屋内\n小間代","小間数","屋外\n小間代","合計","希望","テーマ\n（分野）","名称",null,"新技術\n名称","NETIS\n登録番号\n（半角入力）","技術分野","i-Construction","通信欄","使用","実施"]
[{"$f":"IF($A$17=0,\"\",VLOOKUP($A$17,A18:B19,2,FALSE))","v":""},{"$f":"IF(提出用!$Q$11=\"\",\"\",提出用!$Q$11)","v":""},{"$f":"IF(提出用!$S$11=\"\",\"\",提出用!$S$11)","v":""},null,{"$f":"TODAY()","v":"2020-11-30"},{"$f":"$AG5","v":1},null,{"$f":"IF(提出用!D10=\"\",\"\",提出用!D10)","v":""},{"$f":"IF(提出用!$D$11=\"\",\"\",提出用!$D$11)","v":""},{"$f":"IF(提出用!$D$13=\"\",\"\",提出用!$D$13)","v":""},{"$f":"IF(提出用!$D$14=\"\",\"\",提出用!$D$14)","v":""},{"$f":"IF($L$17=0,\"\",VLOOKUP($L$17,$L$18:$M$22,2,FALSE))","v":""},{"$f":"提出用!$Q$19","v":0},{"$f":"提出用!$D$16","v":0},{"$f":"提出用!$D$18","v":0},{"$f":"IF(提出用!$L$16=\"\",\"\",提出用!$L$16)","v":""},{"$f":"IF(提出用!$Q$16=\"\",\"\",提出用!$Q$16)","v":""},{"$f":"IF(提出用!$E$17=\"\",\"\",提出用!$E$17)","v":""},{"$f":"IF(提出用!$H$17=\"\",\"\",LEFT(提出用!$H$17,3))","v":""},{"$f":"提出用!$H$17","v":0},{"$f":"IF(提出用!$D$19=\"\",\"\",提出用!$D$19)","v":""},{"$f":"IF(提出用!$L$19=\"\",\"\",提出用!$L$19)","v":""},{"$f":"IF($W$17=0,\"\",VLOOKUP($W$17,$W$18:$X$27,2,FALSE))","v":""},{"$f":"IF($Y$17=0,\"\",VLOOKUP(Y17,$Y$18:$Z$19,2,FALSE))","v":""},{"$f":"提出用!$F$32","v":0},{"$f":"$Y$5*$Z$2","v":0},{"$f":"提出用!$S$32","v":0},{"$f":"$AA$5*$AB$2","v":0},{"$f":"SUM($Z5,$AB5)","v":0},{"$f":"IF($AD$17=2,\"\",VLOOKUP($AD$17,$AD$18:$AE$19,2,FALSE))","v":{"$error":"#N/A"}},{"$f":"IFERROR(IF(AD5=\"\",\"\",VLOOKUP(提出用!#REF!,$AG$5:$AK$16,4)),\"\")","v":""},{"$f":"IFERROR(IF(AD5=\"\",\"\",VLOOKUP(提出用!#REF!,$AG$5:$AK$16,2)),\"\")","v":""},1,{"$f":"IF(提出用!$E38=\"\",\"\",提出用!$E38)","v":""},{"$f":"CONCATENATE(提出用!$N38,提出用!$O38,提出用!$R38)","v":""},{"$f":"IF(提出用!$B38=\"\",\"\",提出用!$B38)","v":""},{"$f":"IF(提出用!S38=\"\",\"\",提出用!S38)","v":""},{"$f":"提出用!$B$54","v":0},{"$f":"IF($AM$23=2,\"\",VLOOKUP($AM$23,AM24:AN25,2,FALSE))","v":{"$error":"#N/A"}},{"$f":"IF($AM$27=2,\"\",VLOOKUP($AM$27,AM28:AN29,2,FALSE))","v":{"$error":"#N/A"}}]
[null,null,null,null,null,{"$f":"$AG6","v":2},null,null,null,null,null,null,null,null,null,null,null,null,null,null,null,null,null,null,null,null,null,null,null,null,null,null,2,{"$f":"IF(提出用!$E39=\"\",\"\",提出用!$E39)","v":""},{"$f":"CONCATENATE(提出用!$N39,提出用!$O39,提出用!$R39)","v":""},{"$f":"IF(提出用!$B39=\"\",\"\",提出用!$B39)","v":""},{"$f":"IF(提出用!S39=\"\",\"\",提出用!S39)","v":""}]
[null,null,null,null,null,3,null,null,null,null,null,null,null,null,null,null,null,null,null,null,null,null,null,null,null,null,null,null,null,null,null,null,3,{"$f":"IF(提出用!$E40=\"\",\"\",提出用!$E40)","v":""},{"$f":"CONCATENATE(提出用!$N40,提出用!$O40,提出用!$R40)","v":""},{"$f":"IF(提出用!$B40=\"\",\"\",提出用!$B40)","v":""},{"$f":"IF(提出用!S40=\"\",\"\",提出用!S40)","v":""}]
[null,null,null,null,null,4,null,null,null,null,null,null,null,null,null,null,null,null,null,null,null,null,null,null,null,null,null,null,null,null,null,null,4,{"$f":"IF(提出用!$E41=\"\",\"\",提出用!$E41)","v":""},{"$f":"CONCATENATE(提出用!$N41,提出用!$O41,提出用!$R41)","v":""},{"$f":"IF(提出用!$B41=\"\",\"\",提出用!$B41)","v":""},{"$f":"IF(提出用!S41=\"\",\"\",提出用!S41)","v":""}]
[null,null,null,null,null,5,null,null,null,null,null,null,null,null,null,null,null,null,null,null,null,null,null,null,null,null,null,null,null,null,null,null,5,{"$f":"IF(提出用!$E42=\"\",\"\",提出用!$E42)","v":""},{"$f":"CONCATENATE(提出用!$N42,提出用!$O42,提出用!$R42)","v":""},{"$f":"IF(提出用!$B42=\"\",\"\",提出用!$B42)","v":""},{"$f":"IF(提出用!S42=\"\",\"\",提出用!S42)","v":""}]
[null,null,null,null,null,6,null,null,null,null,null,null,null,null,null,null,null,null,null,null,null,null,null,null,null,null,null,null,null,null,null,null,6,{"$f":"IF(提出用!$E43=\"\",\"\",提出用!$E43)","v":""},{"$f":"CONCATENATE(提出用!$N43,提出用!$O43,提出用!$R43)","v":""},{"$f":"IF(提出用!$B43=\"\",\"\",提出用!$B43)","v":""},{"$f":"IF(提出用!S43=\"\",\"\",提出用!S43)","v":""}]
[null,null,null,null,null,7,null,null,null,null,null,null,null,null,null,null,null,null,null,null,null,null,null,null,null,null,null,null,null,null,null,null,7,{"$f":"IF(提出用!$E44=\"\",\"\",提出用!$E44)","v":""},{"$f":"CONCATENATE(提出用!$N44,提出用!$O44,提出用!$R44)","v":""},{"$f":"IF(提出用!$B44=\"\",\"\",提出用!$B44)","v":""},{"$f":"IF(提出用!S44=\"\",\"\",提出用!S44)","v":""}]
[null,null,null,null,null,8,null,null,null,null,null,null,null,null,null,null,null,null,null,null,null,null,null,null,null,null,null,null,null,null,null,null,8,{"$f":"IF(提出用!$E45=\"\",\"\",提出用!$E45)","v":""},{"$f":"CONCATENATE(提出用!$N45,提出用!$O45,提出用!$R45)","v":""},{"$f":"IF(提出用!$B45=\"\",\"\",提出用!$B45)","v":""},{"$f":"IF(提出用!S45=\"\",\"\",提出用!S45)","v":""}]
[null,null,null,null,null,9,null,null,null,null,null,null,null,null,null,null,null,null,null,null,null,null,null,null,null,null,null,null,null,null,null,null,9,{"$f":"IF(提出用!$E46=\"\",\"\",提出用!$E46)","v":""},{"$f":"CONCATENATE(提出用!$N46,提出用!$O46,提出用!$R46)","v":""},{"$f":"IF(提出用!$B46=\"\",\"\",提出用!$B46)","v":""},{"$f":"IF(提出用!S46=\"\",\"\",提出用!S46)","v":""}]
[null,null,null,null,null,10,null,null,null,null,null,null,null,null,null,null,null,null,null,null,null,null,null,null,null,null,null,null,null,null,null,null,10,{"$f":"IF(提出用!$E47=\"\",\"\",提出用!$E47)","v":""},{"$f":"CONCATENATE(提出用!$N47,提出用!$O47,提出用!$R47)","v":""},{"$f":"IF(提出用!$B47=\"\",\"\",提出用!$B47)","v":""},{"$f":"IF(提出用!S47=\"\",\"\",提出用!S47)","v":""}]
[null,null,null,null,null,11,null,null,null,null,null,null,null,null,null,null,null,null,null,null,null,null,null,null,null,null,null,null,null,null,null,null,11,{"$f":"IF(提出用!$E48=\"\",\"\",提出用!$E48)","v":""},{"$f":"CONCATENATE(提出用!$N48,提出用!$O48,提出用!$R48)","v":""},{"$f":"IF(提出用!$B48=\"\",\"\",提出用!$B48)","v":""},{"$f":"IF(提出用!S48=\"\",\"\",提出用!S48)","v":""}]
[null,null,null,null,null,12,null,null,null,null,null,null,null,null,null,null,null,null,null,null,null,null,null,null,null,null,null,null,null,null,null,null,12,{"$f":"IF(提出用!$E49=\"\",\"\",提出用!$E49)","v":""},{"$f":"CONCATENATE(提出用!$N49,提出用!$O49,提出用!$R49)","v":""},{"$f":"IF(提出用!$B49=\"\",\"\",提出用!$B49)","v":""},{"$f":"IF(提出用!S49=\"\",\"\",提出用!S49)","v":""}]
[0,null,null,null,null,null,null,null,null,null,null,0,null,null,null,null,null,null,null,null,null,null,0,null,0,null,null,null,null,0,null,null,null,null,null,null,null,null,0]
[1,"有り",null,null,"↑データをコピペした日付が入るので場合によっては\nコピペした後に修正必要。",null,null,null,null,null,null,1,"なし",null,null,null,null,null,null,null,null,null,1,"日建連",1,"有","屋内",null,null,1,"有り",null,null,null,null,"設計・施工","Ａ設計・施工",null,1,"単独"]
[2,"無し",null,null,null,null,null,null,null,null,null,2,"1～９",null,null,null,null,null,null,null,null,null,6,"道建協",2,null,"屋外",null,null,2,null,null,null,null,null,"維持管理・予防保全","Ｂ維持管理・予防保全",null,2,"グループ"]
[null,null,null,null,null,null,null,null,null,null,null,3,"10～19",null,null,null,null,null,null,null,null,null,2,"連合会",null,null,null,null,null,null,null,null,null,null,null,"防災・安全","Ｃ防災・安全",null,3,"共同"]
[null,null,null,null,null,null,null,null,null,null,null,4,"20~28",null,null,null,null,null,null,null,null,null,7,"機施協",null,null,null,null,null,null,null,null,null,null,null,"建設リサイクル・その他","Ｄ建設リサイクル・その他"]
[null,null,null,null,null,null,null,null,null,null,null,5,29,null,null,null,null,null,null,null,null,null,3,"東コン"]
[null,null,null,null,null,null,null,null,null,null,null,null,null,null,null,null,null,null,null,null,null,null,8,"法面協",null,null,null,null,null,null,null,null,null,null,null,null,null,null,0]
[null,null,null,null,null,null,"↑★企業・団体　☆大学・行政　選択してから、データベースへコピーする。",null,null,null,null,null,null,null,null,null,null,null,null,null,null,null,4,"埋浚",null,null,null,null,null,null,null,null,null,null,null,null,null,null,1,"使用"]
[null,null,null,null,null,null,null,null,null,null,null,null,null,null,null,null,null,null,null,null,null,null,9,"建電協",null,null,null,null,null,null,null,null,null,null,null,null,null,null,2]
[null,null,null,null,null,null,null,null,null,null,null,null,null,null,null,null,null,null,null,null,null,null,5,"建コン"]
[null,null,null,null,null,null,null,null,null,null,null,null,null,null,null,null,null,null,null,null,null,null,10,"単独",null,null,null,null,null,null,null,null,null,null,null,null,null,null,0]
[null,null,null,null,null,null,null,null,null,null,null,null,null,null,null,null,null,null,null,null,null,null,null,null,null,null,null,null,null,null,null,null,null,null,null,null,null,null,1,"実施する"]
[null,null,null,null,null,null,null,null,null,null,null,null,null,null,null,null,null,null,null,null,null,null,null,null,null,null,null,null,null,null,null,null,null,null,null,null,null,null,2]
[]
[]
[]
[]
[]
[]
[]
[null,null,null,null,null,null,null,null,null,null,null,null,null,null,null,null,null,null,"【表記例】","株式会社","有限会社","合同会社","一般社団法人","一般財団法人","国立研究開発法人","国立大学法人"]
[null,null,null,null,null,null,null,null,null,null,null,null,null,null,null,null,null,null,"かっこは半角","(株)","(有)","(同)","(一社)","(一財)","(国研)","(大)"]